Reaction Details
TargetHigh affinity nerve growth factor receptor
LigandBDBM50446394
Substrate/Competitorn/a
Meas. Tech.Kinase Activity Assay
Temperature298.15±n/a K
EC50 6.5±n/a nM
Commentsextracted
Citation Stachel, SJEgbertson, MBrnardic, EJones, KGSanders, JMHenze, D TrkA kinase inhibitors, compositions and methods thereof US Patent US9181261 Publication Date 11/10/2015
 
High affinity nerve growth factor receptor
Name:High affinity nerve growth factor receptor
Type:n/a
Mol. Mass.:87498.18
Organism:Homo sapiens (Human)
Description:P04629
Residue:796
BDBM50446394
NameBDBM50446394
Synonyms:CHEMBL3109646 | US9181261, 1
TypeSmall organic molecule
Emp. Form.C19H19F3N4OS
Mol. Mass.408.441
SMILESCC(C)N(Cc1c[nH]c2ncccc12)C(=O)Nc1ccc(SC(F)(F)F)cc1