Reaction Details
TargetHigh affinity nerve growth factor receptor
LigandBDBM50022677
Substrate/Competitorn/a
Meas. Tech.Kinase Activity Assay
Temperature298.15±n/a K
EC50 119±n/a nM
Commentsextracted
Citation Stachel, SJEgbertson, MBrnardic, EJones, KGSanders, JMHenze, D TrkA kinase inhibitors, compositions and methods thereof US Patent US9181261 Publication Date 11/10/2015
 
High affinity nerve growth factor receptor
Name:High affinity nerve growth factor receptor
Type:n/a
Mol. Mass.:87498.18
Organism:Homo sapiens (Human)
Description:P04629
Residue:796
BDBM50022677
NameBDBM50022677
Synonyms:CHEMBL3298270 | US9181261, 17
TypeSmall organic molecule
Emp. Form.C21H20F3N3O2S
Mol. Mass.435.463
SMILESCC(C)N(Cc1cccc(c1)-c1nccs1)C(=O)Nc1ccc(OC(F)(F)F)cc1