Reaction Details
TargetHistamine H3 receptor
LigandBDBM50434337
Substrate/Competitorn/a
Meas. Tech.Biological Assay
Temperature298.15±n/a K
Ki 0.032±n/a nM
Commentsextracted
Citation Cowart, MDLiu, HAltenbach, R Mercaptoamidine derivatives and methods of use US Patent US9181275 Publication Date 11/10/2015
 
Histamine H3 receptor
Name:Histamine H3 receptor
Type:G Protein-Coupled Receptor (GPCR)
Mol. Mass.:48607.98
Organism:Rattus norvegicus (rat)
Description:n/a
Residue:445
BDBM50434337
NameBDBM50434337
Synonyms:CHEMBL2386727 | US9181275, 1
TypeSmall organic molecule
Emp. Form.C26H31N3O2S
Mol. Mass.449.608
SMILESCC1=C(SC2=NCc3ccccc3CN12)c1ccc(OCCCN2CCC[C@H]2CO)cc1