Reaction Details
TargetHistamine H3 receptor
LigandBDBM50434336
Substrate/Competitorn/a
Meas. Tech.Biological Assay
Temperature298.15±n/a K
Ki 0.05±n/a nM
Commentsextracted
Citation Cowart, MDLiu, HAltenbach, R Mercaptoamidine derivatives and methods of use US Patent US9181275 Publication Date 11/10/2015
 
Histamine H3 receptor
Name:Histamine H3 receptor
Type:G Protein-Coupled Receptor (GPCR)
Mol. Mass.:48607.98
Organism:Rattus norvegicus (rat)
Description:n/a
Residue:445
BDBM50434336
NameBDBM50434336
Synonyms:CHEMBL2386728 | US9181275, 2
TypeSmall organic molecule
Emp. Form.C26H31N3OS
Mol. Mass.433.609
SMILESCC1=C(SC2=NCc3ccccc3CN12)c1ccc(OCCCN2CCCCC2)cc1