Reaction Details
TargetCasein kinase I isoform alpha
LigandBDBM191587
Substrate/Competitorn/a
Meas. Tech.Radiometric-Based Assay (CK1α)
IC50 5.6e+3± 1.1e+3 nM
Citation Ursu, AIllich, DJTakemoto, YPorfetye, ATZhang, MBrockmeyer, AJanning, PWatanabe, NOsada, HVetter, IRZiegler, SSchöler, HRWaldmann, H Epiblastin A Induces Reprogramming of Epiblast Stem Cells Into Embryonic Stem Cells by Inhibition of Casein Kinase 1. Cell Chem Biol23:494-507 (2016) 
 
Casein kinase I isoform alpha
Name:Casein kinase I isoform alpha
Type:Serine/threonine-protein kinase
Mol. Mass.:38936.59
Organism:Homo sapiens (Human)
Description:P48729
Residue:337
BDBM191587
NameBDBM191587
Synonyms:6-(1-benzothiophen-3-yl)pteridine-2,4,7-triamine (31)
TypeSmall organic molecule
Emp. Form.C14H11N7S
Mol. Mass.309.349
SMILESNc1nc(N)c2nc(-c3csc4ccccc34)c(N)nc2n1