Reaction Details
TargetSerine protease hepsin
LigandBDBM123129
Substrate/Competitorn/a
Meas. Tech.High-Throughput Screening Assay
IC50 280±70 nM
Citation Vasioukhin, VIChevillet, JR Hepsin inhibitors US Patent US9182402 Publication Date 11/10/2015
 
Serine protease hepsin
Name:Serine protease hepsin
Type:Enzyme
Mol. Mass.:45016.98
Organism:Homo sapiens (Human)
Description:Human deglycosylated hepsin was expressed in Pichia pastoris.
Residue:417
BDBM123129
NameBDBM123129
Synonyms:1-(3-nitro-phenyl)-pyrrole-2,5-dione (17) US9182402, 1
TypeSmall organic molecule
Emp. Form.C10H6N2O4
Mol. Mass.218.1656
SMILES[O-][N+](=O)c1cccc(c1)N1C(=O)C=CC1=O