Reaction Details
TargetSerine protease hepsin
LigandBDBM191636
Substrate/Competitorn/a
Meas. Tech.High-Throughput Screening Assay
IC50 980±120 nM
Citation Vasioukhin, VIChevillet, JR Hepsin inhibitors US Patent US9182402 Publication Date 11/10/2015
 
Serine protease hepsin
Name:Serine protease hepsin
Type:Enzyme
Mol. Mass.:45016.98
Organism:Homo sapiens (Human)
Description:Human deglycosylated hepsin was expressed in Pichia pastoris.
Residue:417
BDBM191636
NameBDBM191636
Synonyms:US9182402, 9
TypeSmall organic molecule
Emp. Form.C20H10F5NO3S
Mol. Mass.439.355
SMILESCc1csc(n1)-c1cc2ccc(OCc3c(F)c(F)c(F)c(F)c3F)cc2oc1=O