Reaction Details
TargetSerine protease hepsin
LigandBDBM50041802
Substrate/Competitorn/a
Meas. Tech.High-Throughput Screening Assay
IC50 230±50 nM
Citation Vasioukhin, VIChevillet, JR Hepsin inhibitors US Patent US9182402 Publication Date 11/10/2015
 
Serine protease hepsin
Name:Serine protease hepsin
Type:Enzyme
Mol. Mass.:45016.98
Organism:Homo sapiens (Human)
Description:Human deglycosylated hepsin was expressed in Pichia pastoris.
Residue:417
BDBM50041802
NameBDBM50041802
Synonyms:1,8-dihydroxy-9(10H)-anthracenone 1,8-dihydroxyanthracen-9(10H)-one CHEMBL46469 anthralin dithranol
TypeSmall organic molecule
Emp. Form.C14H10O3
Mol. Mass.226.2274
SMILESOc1cccc2Cc3cccc(O)c3C(=O)c12