Reaction Details
TargetTrypsin
LigandBDBM191634
Substrate/Competitorn/a
Meas. Tech.High-Throughput Screening Assay
IC50 13100±3000 nM
Citation Vasioukhin, VIChevillet, JR Hepsin inhibitors US Patent US9182402 Publication Date 11/10/2015
 
Trypsin
Name:Trypsin
Synonyms:TRYP_PIG
Type:PROTEIN
Mol. Mass.:24411.24
Organism:Sus scrofa
Description:ChEMBL_1450738
Residue:231
BDBM191634
NameBDBM191634
Synonyms:US9182402, 7
TypeSmall organic molecule
Emp. Form.C29H16F2N2O4
Mol. Mass.494.4451
SMILESFc1cccc(c1)-c1nc2ccc(Cc3ccc4nc(oc(=O)c4c3)-c3cccc(F)c3)cc2c(=O)o1