Reaction Details
TargetTrypsin
LigandBDBM191635
Substrate/Competitorn/a
Meas. Tech.High-Throughput Screening Assay
IC50 1710±210 nM
Citation Vasioukhin, VIChevillet, JR Hepsin inhibitors US Patent US9182402 Publication Date 11/10/2015
 
Trypsin
Name:Trypsin
Synonyms:TRYP_PIG
Type:PROTEIN
Mol. Mass.:24411.24
Organism:Sus scrofa
Description:ChEMBL_1450738
Residue:231
BDBM191635
NameBDBM191635
Synonyms:US9182402, 8
TypeSmall organic molecule
Emp. Form.C15H9BrCl2N4OS
Mol. Mass.444.133
SMILESClc1ccc(NC(=O)Nc2nnc(s2)-c2ccc(Br)cc2)cc1Cl