Reaction Details
TargetTrypsin
LigandBDBM191636
Substrate/Competitorn/a
Meas. Tech.High-Throughput Screening Assay
IC50 20900±7500 nM
Citation Vasioukhin, VIChevillet, JR Hepsin inhibitors US Patent US9182402 Publication Date 11/10/2015
 
Trypsin
Name:Trypsin
Synonyms:TRYP_PIG
Type:PROTEIN
Mol. Mass.:24411.24
Organism:Sus scrofa
Description:ChEMBL_1450738
Residue:231
BDBM191636
NameBDBM191636
Synonyms:US9182402, 9
TypeSmall organic molecule
Emp. Form.C20H10F5NO3S
Mol. Mass.439.355
SMILESCc1csc(n1)-c1cc2ccc(OCc3c(F)c(F)c(F)c(F)c3F)cc2oc1=O