Reaction Details
TargetTrypsin
LigandBDBM81467
Substrate/Competitorn/a
Meas. Tech.High-Throughput Screening Assay
IC50>20000±n/a nM
Citation Vasioukhin, VIChevillet, JR Hepsin inhibitors US Patent US9182402 Publication Date 11/10/2015
 
Trypsin
Name:Trypsin
Synonyms:TRYP_PIG
Type:PROTEIN
Mol. Mass.:24411.24
Organism:Sus scrofa
Description:ChEMBL_1450738
Residue:231
BDBM81467
NameBDBM81467
TypeSmall organic molecule
Emp. Form.C25H27ClN2
Mol. Mass.390.948
SMILESCc1cccc(CN2CCN(CC2)C(c2ccccc2)c2ccc(Cl)cc2)c1