Reaction Details
TargetTrypsin
LigandBDBM50007260
Substrate/Competitorn/a
Meas. Tech.High-Throughput Screening Assay
IC50 33500±11500 nM
Citation Vasioukhin, VIChevillet, JR Hepsin inhibitors US Patent US9182402 Publication Date 11/10/2015
 
Trypsin
Name:Trypsin
Synonyms:TRYP_PIG
Type:PROTEIN
Mol. Mass.:24411.24
Organism:Sus scrofa
Description:ChEMBL_1450738
Residue:231
BDBM50007260
NameBDBM50007260
TypeSmall organic molecule
Emp. Form.C31H48O2S2
Mol. Mass.516.842
SMILESCC(C)(Sc1cc(c(O)c(c1)C(C)(C)C)C(C)(C)C)Sc1cc(c(O)c(c1)C(C)(C)C)C(C)(C)C