Reaction Details
TargetE3 ubiquitin-protein ligase Mdm2
LigandBDBM192241
Substrate/Competitorn/a
Meas. Tech.Fluorescence Polarization (FP) Assay
Temperature293.15±n/a K
Ki 1.5±n/a nM
Commentsextracted
Citation Doemling, A p53-Mdm2 antagonists US Patent US9187441 Publication Date 11/17/2015
 
E3 ubiquitin-protein ligase Mdm2
Name:E3 ubiquitin-protein ligase Mdm2
Type:Oncoprotein
Mol. Mass.:55196.54
Organism:Homo sapiens (Human)
Description:Q00987
Residue:491
BDBM192241
NameBDBM192241
Synonyms:US9187441, 6A
TypeSmall organic molecule
Emp. Form.C25H28ClN3O4
Mol. Mass.469.961
SMILESCCOC(=O)c1[nH]c2cc(Cl)ccc2c1C(N(Cc1ccccc1)C=O)C(=O)NC(C)(C)C