Reaction Details
TargetE3 ubiquitin-protein ligase Mdm2
LigandBDBM192221
Substrate/Competitorn/a
Meas. Tech.Fluorescence Polarization (FP) Assay
Temperature293.15±n/a K
Ki 0.15±n/a nM
Commentsextracted
Citation Doemling, A p53-Mdm2 antagonists US Patent US9187441 Publication Date 11/17/2015
 
E3 ubiquitin-protein ligase Mdm2
Name:E3 ubiquitin-protein ligase Mdm2
Type:Oncoprotein
Mol. Mass.:55196.54
Organism:Homo sapiens (Human)
Description:Q00987
Residue:491
BDBM192221
NameBDBM192221
Synonyms:US9187441, 7K
TypeSmall organic molecule
Emp. Form.C23H21ClF3N3O4
Mol. Mass.495.879
SMILESCC(C)(C)NC(=O)C(N(Cc1ccc(F)c(F)c1F)C=O)c1c([nH]c2cc(Cl)ccc12)C(O)=O