Reaction Details
TargetSerine/threonine-protein kinase B-raf [V600E]
LigandBDBM192503
Substrate/Competitorn/a
Meas. Tech.KiNativ assay
IC50 37±n/a nM
Citation Flynn, DLKaufman, MDVogeti, LWise, SLu, WSmith, BCaldwell, TMPatt, WCHenry, JRHipskind, PAPeng, S Raf inhibitor compounds US Patent US9187474 Publication Date 11/17/2015
 
Serine/threonine-protein kinase B-raf [V600E]
Name:Serine/threonine-protein kinase B-raf [V600E]
Type:n/a
Mol. Mass.:84474.98
Organism:Homo sapiens (Human)
Description:P15056 V600E
Residue:766
BDBM192503
NameBDBM192503
Synonyms:US9187474, 18
TypeSmall organic molecule
Emp. Form.C23H28FN5O
Mol. Mass.409.4997
SMILESCNc1cc2nc(C)c(cc2cn1)-c1cc(NC(=O)NCCC(C)(C)C)ccc1F