Reaction Details
TargetRAF proto-oncogene serine/threonine-protein kinase
LigandBDBM192503
Substrate/Competitorn/a
Meas. Tech.KiNativ assay
IC50 20±n/a nM
Citation Flynn, DLKaufman, MDVogeti, LWise, SLu, WSmith, BCaldwell, TMPatt, WCHenry, JRHipskind, PAPeng, S Raf inhibitor compounds US Patent US9187474 Publication Date 11/17/2015
 
RAF proto-oncogene serine/threonine-protein kinase
Name:RAF proto-oncogene serine/threonine-protein kinase
Type:Serine/threonine-protein kinase
Mol. Mass.:73082.52
Organism:Homo sapiens (Human)
Description:P04049
Residue:648
BDBM192503
NameBDBM192503
Synonyms:US9187474, 18
TypeSmall organic molecule
Emp. Form.C23H28FN5O
Mol. Mass.409.4997
SMILESCNc1cc2nc(C)c(cc2cn1)-c1cc(NC(=O)NCCC(C)(C)C)ccc1F