Reaction Details
TargetSerine/threonine-protein kinase B-raf
LigandBDBM192504
Substrate/Competitorn/a
Meas. Tech.KiNativ assay
IC50 16±n/a nM
Citation Flynn, DLKaufman, MDVogeti, LWise, SLu, WSmith, BCaldwell, TMPatt, WCHenry, JRHipskind, PAPeng, S Raf inhibitor compounds US Patent US9187474 Publication Date 11/17/2015
 
Serine/threonine-protein kinase B-raf
Name:Serine/threonine-protein kinase B-raf
Type:Serine/threonine-protein kinase
Mol. Mass.:84446.00
Organism:Homo sapiens (Human)
Description:P15056
Residue:766
BDBM192504
NameBDBM192504
Synonyms:US9187474, 76
TypeSmall organic molecule
Emp. Form.C23H27F2N5O
Mol. Mass.427.4902
SMILESCNc1cc2nc(C)c(cc2cn1)-c1cc(NC(=O)NCCC(C)(C)F)c(F)cc1C