Reaction Details
TargetTrifunctional purine biosynthetic protein adenosine-3
LigandBDBM50442984
Substrate/Competitorn/a
Meas. Tech.GAR Transformylase Inhibition Assay
pH7.5±n/a
IC50 99±13 nM
Commentsextracted
Citation Deis, SMDoshi, AHou, ZMatherly, LHGangjee, ADann, CE Structural and Enzymatic Analysis of Tumor-Targeted Antifolates That Inhibit Glycinamide Ribonucleotide Formyltransferase. Biochemistry55:4574-82 (2016) 
 
Trifunctional purine biosynthetic protein adenosine-3
Name:Trifunctional purine biosynthetic protein adenosine-3
Type:Protein
Mol. Mass.:107768.47
Organism:Homo sapiens (Human)
Description:P22102
Residue:1010
BDBM50442984
NameBDBM50442984
Synonyms:AGF147 | CHEMBL3086866
TypeSmall organic molecule
Emp. Form.C19H27N5O6
Mol. Mass.421.4476
SMILESNc1nc2[nH]c(CCCCCCCC(=O)N[C@@H](CCC(O)=O)C(O)=O)cc2c(=O)[nH]1