Reaction Details
TargetPoly [ADP-ribose] polymerase tankyrase-1 [1068-1325]
LigandBDBM192896
Substrate/Competitorn/a
Meas. Tech.Chemiluminescent PARP Assay
IC50 33±n/a nM
Citation Ashworth, ALord, CJElliot, RJNiculescu-Duvaz, DPorter, RBoffey, RJBayford, MJFirth-Clark, SJarvis, ANPerrior, TRKey, RE 3-aryl-5-substituted-isoquinolin-1-one compounds and their therapeutic use US Patent US9193689 Publication Date 11/24/2015
 
Poly [ADP-ribose] polymerase tankyrase-1 [1068-1325]
Name:Poly [ADP-ribose] polymerase tankyrase-1 [1068-1325]
Type:Protein
Mol. Mass.:29381.76
Organism:Homo sapiens (Human)
Description:PDB: 2RF5
Residue:258
BDBM192896
NameBDBM192896
Synonyms:US9193689, REF-1
TypeSmall organic molecule
Emp. Form.C18H19N5O
Mol. Mass.321.3764
SMILESCN1CCN(CC1)c1ncc(cn1)-c1cc2ccccc2c(=O)[nH]1