Reaction Details
TargetPoly [ADP-ribose] polymerase tankyrase-1 [1068-1325]
LigandBDBM192898
Substrate/Competitorn/a
Meas. Tech.Chemiluminescent PARP Assay
IC50 48±n/a nM
Citation Ashworth, ALord, CJElliot, RJNiculescu-Duvaz, DPorter, RBoffey, RJBayford, MJFirth-Clark, SJarvis, ANPerrior, TRKey, RE 3-aryl-5-substituted-isoquinolin-1-one compounds and their therapeutic use US Patent US9193689 Publication Date 11/24/2015
 
Poly [ADP-ribose] polymerase tankyrase-1 [1068-1325]
Name:Poly [ADP-ribose] polymerase tankyrase-1 [1068-1325]
Type:Protein
Mol. Mass.:29381.76
Organism:Homo sapiens (Human)
Description:PDB: 2RF5
Residue:258
BDBM192898
NameBDBM192898
Synonyms:US9193689, REF-2
TypeSmall organic molecule
Emp. Form.C21H22FN3O
Mol. Mass.351.4173
SMILESCN1CCN(Cc2ccc(cc2)-c2cc3ccc(F)cc3c(=O)[nH]2)CC1