Reaction Details
TargetPoly [ADP-ribose] polymerase tankyrase-1 [1068-1325]
LigandBDBM192902
Substrate/Competitorn/a
Meas. Tech.Chemiluminescent PARP Assay
IC50 12±n/a nM
Citation Ashworth, ALord, CJElliot, RJNiculescu-Duvaz, DPorter, RBoffey, RJBayford, MJFirth-Clark, SJarvis, ANPerrior, TRKey, RE 3-aryl-5-substituted-isoquinolin-1-one compounds and their therapeutic use US Patent US9193689 Publication Date 11/24/2015
 
Poly [ADP-ribose] polymerase tankyrase-1 [1068-1325]
Name:Poly [ADP-ribose] polymerase tankyrase-1 [1068-1325]
Type:Protein
Mol. Mass.:29381.76
Organism:Homo sapiens (Human)
Description:PDB: 2RF5
Residue:258
BDBM192902
NameBDBM192902
Synonyms:US9193689, IQ-034
TypeSmall organic molecule
Emp. Form.C19H20N2O
Mol. Mass.292.3749
SMILESCN(C)Cc1ccc(cc1)-c1cc2c(C)cccc2c(=O)[nH]1