Reaction Details
TargetLysosomal Pro-X carboxypeptidase
LigandBDBM193262
Substrate/Competitorn/a
Meas. Tech.Activation Assay
Ki 141400±n/a nM
Citation Shariat-Madar, ZRimoldi, JMGadepalli, RS Selective inhibitors of prolylcarboxypeptidase US Patent US9193762 Publication Date 11/24/2015
 
Lysosomal Pro-X carboxypeptidase
Name:Lysosomal Pro-X carboxypeptidase
Type:Enzyme
Mol. Mass.:55805.19
Organism:Homo sapiens (Human)
Description:P42785
Residue:496
BDBM193262
NameBDBM193262
Synonyms:US9193762, RS-33-6
TypeSmall organic molecule
Emp. Form.C34H55N3O4
Mol. Mass.569.8182
(=O)[C@@H]1CCCN1C(=O)[C@@H]1CCCN1C(=O)OCc1ccccc1