Reaction Details
TargetLysosomal Pro-X carboxypeptidase
LigandBDBM193265
Substrate/Competitorn/a
Meas. Tech.Activation Assay
Ki 192900±n/a nM
Citation Shariat-Madar, ZRimoldi, JMGadepalli, RS Selective inhibitors of prolylcarboxypeptidase US Patent US9193762 Publication Date 11/24/2015
 
Lysosomal Pro-X carboxypeptidase
Name:Lysosomal Pro-X carboxypeptidase
Type:Enzyme
Mol. Mass.:55805.19
Organism:Homo sapiens (Human)
Description:P42785
Residue:496
BDBM193265
NameBDBM193265
Synonyms:US9193762, RS-33-10
TypeSmall organic molecule
Emp. Form.C25H27Cl2N3O4
Mol. Mass.504.406
SMILESClc1ccc(CNC(=O)[C@@H]2CCCN2C(=O)[C@@H]2CCCN2C(=O)OCc2ccccc2)c(Cl)c1