Reaction Details
TargetLysosomal Pro-X carboxypeptidase
LigandBDBM193278
Substrate/Competitorn/a
Meas. Tech.Activation Assay
Ki 17400±n/a nM
Citation Shariat-Madar, ZRimoldi, JMGadepalli, RS Selective inhibitors of prolylcarboxypeptidase US Patent US9193762 Publication Date 11/24/2015
 
Lysosomal Pro-X carboxypeptidase
Name:Lysosomal Pro-X carboxypeptidase
Type:Enzyme
Mol. Mass.:55805.19
Organism:Homo sapiens (Human)
Description:P42785
Residue:496
BDBM193278
NameBDBM193278
Synonyms:US9193762, RS-47-06
TypeSmall organic molecule
Emp. Form.C21H39N3O2
Mol. Mass.365.5533
(=O)[C@@H]1CCCN1C(=O)[C@@H]1CCN1