Reaction Details
TargetLysosomal Pro-X carboxypeptidase
LigandBDBM193287
Substrate/Competitorn/a
Meas. Tech.Activation Assay
Ki 5.8e+4±n/a nM
Citation Shariat-Madar, ZRimoldi, JMGadepalli, RS Selective inhibitors of prolylcarboxypeptidase US Patent US9193762 Publication Date 11/24/2015
 
Lysosomal Pro-X carboxypeptidase
Name:Lysosomal Pro-X carboxypeptidase
Type:Enzyme
Mol. Mass.:55805.19
Organism:Homo sapiens (Human)
Description:P42785
Residue:496
BDBM193287
NameBDBM193287
Synonyms:US9193762, RS-37-06
TypeSmall organic molecule
Emp. Form.C29H47N3O4
Mol. Mass.501.7012
(=O)CCCNC(=O)[C@@H]1CCCN1C(=O)OCc1ccccc1