Reaction Details
TargetCarbonic anhydrase 1
LigandBDBM193736
Substrate/Competitorn/a
Meas. Tech.In vitro Carbonic Anhydrase Inhibition Assay
Ki 1663± 255 nM
Citation Mert, SAlim, ZIsgör, MMBeydemir, Å¿Kasimogullari, R The synthesis of novel pyrazole-3,4-dicarboxamides bearing 5-amino-1,3,4-thiadiazole-2-sulfonamide moiety with effective inhibitory activity against the isoforms of human cytosolic carbonic anhydrase I and II. Bioorg Chem68:64-71 (2016) 
 
Carbonic anhydrase 1
Name:Carbonic anhydrase 1
Type:Enzyme
Mol. Mass.:28873.37
Organism:Homo sapiens (Human)
Description:P00915
Residue:261
BDBM193736
NameBDBM193736
Synonyms:1-(3-((2-Hydroxynaphthalen-1-yl)diazenyl)phenyl)-5-phenyl-N3,N4-bis(5-sulfamoyl-1,3,4-thiadiazol-2-yl)-1H-pyrazole-3,4-dicarboxamide (4)
TypeSmall organic molecule
Emp. Form.C31H22N12O7S4
Mol. Mass.802.843
SMILESNS(=O)(=O)c1nnc(NC(=O)c2nn(c(c2C(=O)Nc2nnc(s2)S(N)(=O)=O)-c2ccccc2)-c2cccc(c2)\N=N\c2c(O)ccc3ccccc23)s1