Reaction Details
TargetCarbonic anhydrase 1
LigandBDBM193737
Substrate/Competitorn/a
Meas. Tech.In vitro Carbonic Anhydrase Inhibition Assay
Ki 767± 132 nM
Citation Mert, SAlim, ZIsgör, MMBeydemir, Å¿Kasimogullari, R The synthesis of novel pyrazole-3,4-dicarboxamides bearing 5-amino-1,3,4-thiadiazole-2-sulfonamide moiety with effective inhibitory activity against the isoforms of human cytosolic carbonic anhydrase I and II. Bioorg Chem68:64-71 (2016) 
 
Carbonic anhydrase 1
Name:Carbonic anhydrase 1
Type:Enzyme
Mol. Mass.:28873.37
Organism:Homo sapiens (Human)
Description:P00915
Residue:261
BDBM193737
NameBDBM193737
Synonyms:1-(3-(2-(2,4-Dioxopentan-3-ylidene)hydrazinyl)phenyl)-5-phenyl-N3,N4-bis(5-sulfamoyl-1,3,4-thiadiazol-2-yl)-1H-pyrazole-3,4-dicarboxamide (5)
TypeSmall organic molecule
Emp. Form.C26H22N12O8S4
Mol. Mass.758.788
SMILES[#6]-[#6](=O)-[#6](=[#7]/[#7]-c1cccc(c1)-n1nc(-[#6](=O)-[#7]-c2nnc(s2)S([#7])(=O)=O)c(-[#6](=O)-[#7]-c2nnc(s2)S([#7])(=O)=O)c1-c1ccccc1)\[#6](-[#6])=O