Reaction Details
TargetCarbonic anhydrase 1
LigandBDBM193738
Substrate/Competitorn/a
Meas. Tech.In vitro Carbonic Anhydrase Inhibition Assay
Ki 119± 147 nM
Citation Mert, SAlim, ZIsgör, MMBeydemir, Å¿Kasimogullari, R The synthesis of novel pyrazole-3,4-dicarboxamides bearing 5-amino-1,3,4-thiadiazole-2-sulfonamide moiety with effective inhibitory activity against the isoforms of human cytosolic carbonic anhydrase I and II. Bioorg Chem68:64-71 (2016) 
 
Carbonic anhydrase 1
Name:Carbonic anhydrase 1
Type:Enzyme
Mol. Mass.:28873.37
Organism:Homo sapiens (Human)
Description:P00915
Residue:261
BDBM193738
NameBDBM193738
Synonyms:1-(3-(2-(1,3-Dioxo-1-phenylbutan-2-ylidene)hydrazinyl)phenyl)-5-phenyl-N3,N4-bis(5-sulfamoyl-1,3,4-thiadiazol-2-yl)-1H-pyrazole-3,4-dicarboxamide (6)
TypeSmall organic molecule
Emp. Form.C31H24N12O8S4
Mol. Mass.820.858
SMILESCC(=O)C(=N\Nc1cccc(c1)-n1nc(C(=O)Nc2nnc(s2)S(N)(=O)=O)c(C(=O)Nc2nnc(s2)S(N)(=O)=O)c1-c1ccccc1)\C(=O)c1ccccc1