Reaction Details
TargetCarbonic anhydrase 1
LigandBDBM193740
Substrate/Competitorn/a
Meas. Tech.In vitro Carbonic Anhydrase Inhibition Assay
Ki 3999± 2503 nM
Citation Mert, SAlim, ZIsgör, MMBeydemir, Å¿Kasimogullari, R The synthesis of novel pyrazole-3,4-dicarboxamides bearing 5-amino-1,3,4-thiadiazole-2-sulfonamide moiety with effective inhibitory activity against the isoforms of human cytosolic carbonic anhydrase I and II. Bioorg Chem68:64-71 (2016) 
 
Carbonic anhydrase 1
Name:Carbonic anhydrase 1
Type:Enzyme
Mol. Mass.:28873.37
Organism:Homo sapiens (Human)
Description:P00915
Residue:261
BDBM193740
NameBDBM193740
Synonyms:1-(3-(2-(1,3-Dioxo-1,3-diphenylpropan-2-ylidene)hydrazinyl)phenyl)-5-phenyl-N3,N4-bis(5-sulfamoyl-1,3,4-thiadiazol-2-yl)-1Hpyrazole-3,4-dicarboxamide (8)
TypeSmall organic molecule
Emp. Form.C36H26N12O8S4
Mol. Mass.882.927
SMILES[#7]S(=O)(=O)c1nnc(-[#7]-[#6](=O)-c2nn(c(c2-[#6](=O)-[#7]-c2nnc(s2)S([#7])(=O)=O)-c2ccccc2)-c2cccc(-[#7]\[#7]=[#6](/[#6](=O)-c3ccccc3)-[#6](=O)-c3ccccc3)c2)s1