Reaction Details
TargetCarbonic anhydrase 2
LigandBDBM193746
Substrate/Competitorn/a
Meas. Tech.In vitro Carbonic Anhydrase Inhibition Assay
Ki 288± 5 nM
Citation Mert, SAlim, ZIsgör, MMBeydemir, Å¿Kasimogullari, R The synthesis of novel pyrazole-3,4-dicarboxamides bearing 5-amino-1,3,4-thiadiazole-2-sulfonamide moiety with effective inhibitory activity against the isoforms of human cytosolic carbonic anhydrase I and II. Bioorg Chem68:64-71 (2016) 
 
Carbonic anhydrase 2
Name:Carbonic anhydrase 2
Type:Enzyme
Mol. Mass.:29250.71
Organism:Homo sapiens (Human)
Description:P00918
Residue:260
BDBM193746
NameBDBM193746
Synonyms:1-(3-((2-Hydroxy-4,4-dimethyl-6-oxocyclohex-1-en-1-yl)diazenyl)phenyl)-5-phenyl-N3,N4-bis(5-sulfamoyl-1,3,4-thiadiazol-2-yl)-1H-pyrazole-3,4-dicarboxamide (14)
TypeSmall organic molecule
Emp. Form.C29H26N12O8S4
Mol. Mass.798.852
SMILES[#6]C1([#6])[#6]-[#6](=O)\[#6](=[#7]/[#7]-c2cccc(c2)-n2nc(-[#6](=O)-[#7]-c3nnc(s3)S([#7])(=O)=O)c(-[#6](=O)-[#7]-c3nnc(s3)S([#7])(=O)=O)c2-c2ccccc2)-[#6](=O)-[#6]1