Reaction Details
TargetCarbonic anhydrase 2
LigandBDBM193779
Substrate/Competitorn/a
Meas. Tech.Carbonic Anhydrase (bCAII) Inhibition Assay
pH7.2±n/a
IC50 3.593e+4± 3.9e+2 nM
Commentsextracted
Citation Imran, STaha, MIsmail, NHFayyaz, SKhan, KMChoudhary, MI Synthesis of novel bisindolylmethanes: New carbonic anhydrase II inhibitors, docking, and 3D pharmacophore studies. Bioorg Chem68:90-104 (2016) 
 
Carbonic anhydrase 2
Name:Carbonic anhydrase 2
Type:Enzyme Catalytic Domain
Mol. Mass.:29115.93
Organism:Bos taurus
Description:n/a
Residue:260
BDBM193779
NameBDBM193779
Synonyms:N-(4-(di(1H-indol-3-yl)methyl)phenyl)-2-nitrobenzenesulfonamide (3d)
TypeSmall organic molecule
Emp. Form.C29H22N4O4S
Mol. Mass.522.574
SMILES[O-][N+](=O)c1ccccc1S(=O)(=O)Nc1ccc(cc1)C(c1c[nH]c2ccccc12)c1c[nH]c2ccccc12