Reaction Details
TargetIsoform PDE10A2 of cAMP and cAMP-inhibited cGMP 3',5'-cyclic phosphodiesterase 10A (PDE10A2)
LigandBDBM194094
Substrate/Competitorn/a
Meas. Tech.Fluorescence Polarization Assay
Ki 0.073±n/a nM
Citation Cox, CDDudkin, VYKim, JJKuduk, SDMcVean, CAReger, TSheen, JTSteele, T Triazolyl PDE10 inhibitors US Patent US9200001 Publication Date 12/1/2015
 
Isoform PDE10A2 of cAMP and cAMP-inhibited cGMP 3',5'-cyclic phosphodiesterase 10A (PDE10A2)
Name:Isoform PDE10A2 of cAMP and cAMP-inhibited cGMP 3',5'-cyclic phosphodiesterase 10A (PDE10A2)
Type:Enzyme
Mol. Mass.:89387.03
Organism:Homo sapiens (Human)
Description:Q9Y233-2
Residue:789
BDBM194094
NameBDBM194094
Synonyms:US9200001, 7
TypeSmall organic molecule
Emp. Form.C27H23N7O2
Mol. Mass.477.5172
SMILESCOc1ccc(Cc2nc(C)nn2-c2cc(nc(C)n2)C#Cc2ccc3ccccc3n2)nc1OC