Reaction Details
TargetIsoform PDE10A2 of cAMP and cAMP-inhibited cGMP 3',5'-cyclic phosphodiesterase 10A (PDE10A2)
LigandBDBM194105
Substrate/Competitorn/a
Meas. Tech.Fluorescence Polarization Assay
Ki 0.002±n/a nM
Citation Cox, CDDudkin, VYKim, JJKuduk, SDMcVean, CAReger, TSheen, JTSteele, T Triazolyl PDE10 inhibitors US Patent US9200001 Publication Date 12/1/2015
 
Isoform PDE10A2 of cAMP and cAMP-inhibited cGMP 3',5'-cyclic phosphodiesterase 10A (PDE10A2)
Name:Isoform PDE10A2 of cAMP and cAMP-inhibited cGMP 3',5'-cyclic phosphodiesterase 10A (PDE10A2)
Type:Enzyme
Mol. Mass.:89387.03
Organism:Homo sapiens (Human)
Description:Q9Y233-2
Residue:789
BDBM194105
NameBDBM194105
Synonyms:US9200001, 19
TypeSmall organic molecule
Emp. Form.C24H24N6O2
Mol. Mass.428.4864
SMILESCOc1ccc(Cc2nc(C)nn2-c2cc(\C=C\c3ccccn3)nc(C)n2)cc1OC