Reaction Details
TargetIsoform PDE10A2 of cAMP and cAMP-inhibited cGMP 3',5'-cyclic phosphodiesterase 10A (PDE10A2)
LigandBDBM194127
Substrate/Competitorn/a
Meas. Tech.Fluorescence Polarization Assay
Ki 0.39±n/a nM
Citation Cox, CDDudkin, VYKim, JJKuduk, SDMcVean, CAReger, TSheen, JTSteele, T Triazolyl PDE10 inhibitors US Patent US9200001 Publication Date 12/1/2015
 
Isoform PDE10A2 of cAMP and cAMP-inhibited cGMP 3',5'-cyclic phosphodiesterase 10A (PDE10A2)
Name:Isoform PDE10A2 of cAMP and cAMP-inhibited cGMP 3',5'-cyclic phosphodiesterase 10A (PDE10A2)
Type:Enzyme
Mol. Mass.:89387.03
Organism:Homo sapiens (Human)
Description:Q9Y233-2
Residue:789
BDBM194127
NameBDBM194127
Synonyms:US9200001, 43
TypeSmall organic molecule
Emp. Form.C26H28N6O3
Mol. Mass.472.5389
SMILESCOc1ccc(nc1)C1CC1c1cc(nc(C)n1)-n1nc(C)nc1Cc1ccc(OC)c(OC)c1