Reaction Details
TargetHypoxanthine-guanine phosphoribosyltransferase
LigandBDBM194496
Substrate/Competitorn/a
Meas. Tech.Spectrophotometric Assay
pH7.4±n/a
Ki 70±20 nM
Commentsextracted
Citation De Jersey, JGuddat, LWHockova, DKeough, DT 6-oxopurine phosphoribosyltransferase inhibitors US Patent US9200020 Publication Date 12/1/2015
 
Hypoxanthine-guanine phosphoribosyltransferase
Name:Hypoxanthine-guanine phosphoribosyltransferase
Type:Protein
Mol. Mass.:24579.61
Organism:Homo sapiens (Human)
Description:P00492
Residue:218
BDBM194496
NameBDBM194496
Synonyms:US9200020, Table 3 compound 5
TypeSmall organic molecule
Emp. Form.C12H19N7O4P
Mol. Mass.356.2975
SMILESNc1nc2n(CCN(CCC#N)CCP(O)(O)=O)c[nH]c2c(=O)[nH]1