Reaction Details
TargetC-X-C chemokine receptor type 4
LigandBDBM194520
Substrate/Competitorn/a
Meas. Tech.Competitive Binding Assay
IC50 10±n/a nM
Citation Natchus, MGArrendale, RLiotta, D Tricyclic amino containing compounds for treatment or prevention of symptoms associated with endocrine dysfunction US Patent US9205085 Publication Date 12/8/2015
 
C-X-C chemokine receptor type 4
Name:C-X-C chemokine receptor type 4
Type:Enzyme
Mol. Mass.:39342.13
Organism:Rattus norvegicus (Rat)
Description:O08565
Residue:349
BDBM194520
NameBDBM194520
Synonyms:US9205085, MSX- 200
TypeSmall organic molecule
Emp. Form.C18H20N6O2
Mol. Mass.352.3904
SMILESCOc1ccnc(NCc2ccc(CNc3nccc(OC)n3)cc2)n1