Reaction Details
TargetC-X-C chemokine receptor type 4
LigandBDBM194559
Substrate/Competitorn/a
Meas. Tech.Competitive Binding Assay
IC50 10±n/a nM
Citation Natchus, MGArrendale, RLiotta, D Tricyclic amino containing compounds for treatment or prevention of symptoms associated with endocrine dysfunction US Patent US9205085 Publication Date 12/8/2015
 
C-X-C chemokine receptor type 4
Name:C-X-C chemokine receptor type 4
Type:Enzyme
Mol. Mass.:39342.13
Organism:Rattus norvegicus (Rat)
Description:O08565
Residue:349
BDBM194559
NameBDBM194559
Synonyms:US9205085, MSX- 190
TypeSmall organic molecule
Emp. Form.C14H10Cl4N8
Mol. Mass.432.095
SMILESClc1nc(Cl)nc(NCc2ccc(CNc3nc(Cl)nc(Cl)n3)cc2)n1