Reaction Details
TargetC-X-C chemokine receptor type 4
LigandBDBM194566
Substrate/Competitorn/a
Meas. Tech.Competitive Binding Assay
IC50<100±n/a nM
Citation Natchus, MGArrendale, RLiotta, D Tricyclic amino containing compounds for treatment or prevention of symptoms associated with endocrine dysfunction US Patent US9205085 Publication Date 12/8/2015
 
C-X-C chemokine receptor type 4
Name:C-X-C chemokine receptor type 4
Type:Enzyme
Mol. Mass.:39342.13
Organism:Rattus norvegicus (Rat)
Description:O08565
Residue:349
BDBM194566
NameBDBM194566
Synonyms:US9205085, MSX- 198
TypeSmall organic molecule
Emp. Form.C17H17N5
Mol. Mass.291.3504
SMILESC(Nc1ccccn1)c1ccc(CNc2ncccn2)cc1