Reaction Details
TargetC-X-C chemokine receptor type 4
LigandBDBM194569
Substrate/Competitorn/a
Meas. Tech.Competitive Binding Assay
IC50 1±n/a nM
Citation Natchus, MGArrendale, RLiotta, D Tricyclic amino containing compounds for treatment or prevention of symptoms associated with endocrine dysfunction US Patent US9205085 Publication Date 12/8/2015
 
C-X-C chemokine receptor type 4
Name:C-X-C chemokine receptor type 4
Type:Enzyme
Mol. Mass.:39342.13
Organism:Rattus norvegicus (Rat)
Description:O08565
Residue:349
BDBM194569
NameBDBM194569
Synonyms:US9205085, MSX- 202
TypeSmall organic molecule
Emp. Form.C14H14N2O3
Mol. Mass.258.2726
SMILESOCc1ccc(CNc2ccccc2[N+]([O-])=O)cc1