Reaction Details
TargetC-X-C chemokine receptor type 4
LigandBDBM194580
Substrate/Competitorn/a
Meas. Tech.Competitive Binding Assay
IC50 100±n/a nM
Citation Natchus, MGArrendale, RLiotta, D Tricyclic amino containing compounds for treatment or prevention of symptoms associated with endocrine dysfunction US Patent US9205085 Publication Date 12/8/2015
 
C-X-C chemokine receptor type 4
Name:C-X-C chemokine receptor type 4
Type:Enzyme
Mol. Mass.:39342.13
Organism:Rattus norvegicus (Rat)
Description:O08565
Residue:349
BDBM194580
NameBDBM194580
Synonyms:US9205085, MSX- 214
TypeSmall organic molecule
Emp. Form.C21H20N2O2
Mol. Mass.332.3957
SMILESOC(=O)c1cccc(NCc2ccc(CNc3ccccc3)cc2)c1