Reaction Details
TargetADAM metallopeptidase with thrombospondin type 1 motif 4
LigandBDBM194639
Substrate/Competitorn/a
Meas. Tech.AlphaScreen Assay
pH7.5±n/a
Temperature298.15±n/a K
IC50 1±n/a nM
Commentsextracted
Citation Durham, TBMarimuthu, JWiley, MR Aggrecanase inhibitors US Patent US9206139 Publication Date 12/8/2015
 
ADAM metallopeptidase with thrombospondin type 1 motif 4
Name:ADAM metallopeptidase with thrombospondin type 1 motif 4
Synonyms:Metalloproteinase with thrombospondin motifs 4 (ADAMTS-4)
Type:Enzyme
Mol. Mass.:106624.01
Organism:Canis lupus familiaris (Dog)
Description:A0A8I3Q3A2
Residue:992
BDBM194639
NameBDBM194639
Synonyms:US9206139, 2
TypeSmall organic molecule
Emp. Form.C19H22F3N3O3
Mol. Mass.397.3915
SMILESCC[C@H](Cc1ccc(cc1)C(F)(F)F)C(=O)NC[C@]1(NC(=O)NC1=O)C1CC1