Reaction Details
TargetMatrilysin
LigandBDBM194638
Substrate/Competitorn/a
Meas. Tech.In Vitro Fluorescence Assay
pH7.5±n/a
IC50>100000±n/a nM
Commentsextracted
Citation Durham, TBMarimuthu, JWiley, MR Aggrecanase inhibitors US Patent US9206139 Publication Date 12/8/2015
 
Matrilysin
Name:Matrilysin
Type:Enzyme
Mol. Mass.:29681.54
Organism:Homo sapiens (Human)
Description:P09237
Residue:267
BDBM194638
NameBDBM194638
Synonyms:US9206139, 1
TypeSmall organic molecule
Emp. Form.C18H20F3N3O3
Mol. Mass.383.3649
SMILESC[C@H](Cc1ccc(cc1)C(F)(F)F)C(=O)NC[C@]1(NC(=O)NC1=O)C1CC1