Reaction Details
TargetMatrilysin
LigandBDBM194646
Substrate/Competitorn/a
Meas. Tech.In Vitro Fluorescence Assay
pH7.5±n/a
IC50>100000±n/a nM
Commentsextracted
Citation Durham, TBMarimuthu, JWiley, MR Aggrecanase inhibitors US Patent US9206139 Publication Date 12/8/2015
 
Matrilysin
Name:Matrilysin
Type:Enzyme
Mol. Mass.:29681.54
Organism:Homo sapiens (Human)
Description:P09237
Residue:267
BDBM194646
NameBDBM194646
Synonyms:US9206139, 5
TypeSmall organic molecule
Emp. Form.C19H22F3N3O3
Mol. Mass.397.3915
SMILESCC(C)(Cc1ccc(cc1)C(F)(F)F)C(=O)NC[C@]1(NC(=O)NC1=O)C1CC1