Reaction Details
TargetD(2) dopamine receptor
LigandBDBM194814
Substrate/Competitorn/a
Meas. Tech.Dopamine D2 Receptor Binding Assay
pH7.4±n/a
Temperature298.15±n/a K
Ki 1±n/a nM
Commentsextracted
Citation Yamashita, HIto, NMiyamura, SOshima, KMatsubara, JKuroda, HTakahashi, HShimizu, STanaka, T Piperazine-substituted benzothiophenes for treatment of mental disorders US Patent US9206167 Publication Date 12/8/2015
 
D(2) dopamine receptor
Name:D(2) dopamine receptor
Type:G Protein-Coupled Receptor (GPCR)
Mol. Mass.:50931.60
Organism:Rattus norvegicus (rat)
Description:P61169
Residue:444
BDBM194814
NameBDBM194814
Synonyms:US9206167, 36 | USRE48059, Compound of Example 36
TypeSmall organic molecule
Emp. Form.C25H27N3O2S
Mol. Mass.433.566
SMILESCn1ccc2ccc(OCCCN3CCN(CC3)c3cccc4sccc34)cc2c1=O