Reaction Details
TargetD(2) dopamine receptor
LigandBDBM194766
Substrate/Competitorn/a
Meas. Tech.Dopamine D2 Receptor Binding Assay
pH7.4±n/a
Temperature298.15±n/a K
Ki 1.7±n/a nM
Commentsextracted
Citation Yamashita, HIto, NMiyamura, SOshima, KMatsubara, JKuroda, HTakahashi, HShimizu, STanaka, T Piperazine-substituted benzothiophenes for treatment of mental disorders US Patent US9206167 Publication Date 12/8/2015
 
D(2) dopamine receptor
Name:D(2) dopamine receptor
Type:G Protein-Coupled Receptor (GPCR)
Mol. Mass.:50931.60
Organism:Rattus norvegicus (rat)
Description:P61169
Residue:444
BDBM194766
NameBDBM194766
Synonyms:US9206167, 92
TypeSmall organic molecule
Emp. Form.C27H32FN3O2S
Mol. Mass.481.625
SMILESCN1CCc2cc(F)c(COCCCCN3CCN(CC3)c3cccc4sccc34)cc2C1=O