Reaction Details
Target5-hydroxytryptamine receptor 2A
LigandBDBM194757
Substrate/Competitorn/a
Meas. Tech.Serotonin 5-HT2A Receptor Binding Assay
pH7.4±n/a
Temperature310.15±n/a K
Ki 1.3±n/a nM
Commentsextracted
Citation Yamashita, HIto, NMiyamura, SOshima, KMatsubara, JKuroda, HTakahashi, HShimizu, STanaka, T Piperazine-substituted benzothiophenes for treatment of mental disorders US Patent US9206167 Publication Date 12/8/2015
 
5-hydroxytryptamine receptor 2A
Name:5-hydroxytryptamine receptor 2A
Type:G Protein-Coupled Receptor (GPCR)
Mol. Mass.:52852.05
Organism:Rattus norvegicus (rat)
Description:Rat cortex membranes 5-HT2A receptors.
Residue:471
BDBM194757
NameBDBM194757
Synonyms:US9206167, 73
TypeSmall organic molecule
Emp. Form.C24H25N3OS
Mol. Mass.403.54
SMILESC(COc1cccc2cccnc12)CN1CCN(CC1)c1cccc2sccc12