Reaction Details
TargetTyrosine-protein kinase JAK3
LigandBDBM195815
Substrate/Competitorn/a
Meas. Tech.Biochemical Inhibition Assay
IC50<5±n/a nM
Citation Vankayalapati, HYerramreddy, VGangireddy, PAppalaneni, RP Substituted pyrrolo[2,3-b]pyridines as ITK and JAK inhibitors US Patent US9206188 Publication Date 12/8/2015
 
Tyrosine-protein kinase JAK3
Name:Tyrosine-protein kinase JAK3
Type:Protein
Mol. Mass.:125111.08
Organism:Homo sapiens (Human)
Description:P52333
Residue:1124
BDBM195815
NameBDBM195815
Synonyms:US9206188, 66 | US9834551, Example 74
TypeSmall organic molecule
Emp. Form.C24H18N4O
Mol. Mass.378.4259
SMILESC=CC(=O)Nc1cccc(c1)-c1cnc2[nH]cc(-c3cc4ccccc4[nH]3)c2c1