Reaction Details
TargetTyrosine-protein kinase JAK3
LigandBDBM195827
Substrate/Competitorn/a
Meas. Tech.Biochemical Inhibition Assay
IC50<5±n/a nM
Citation Vankayalapati, HYerramreddy, VGangireddy, PAppalaneni, RP Substituted pyrrolo[2,3-b]pyridines as ITK and JAK inhibitors US Patent US9206188 Publication Date 12/8/2015
 
Tyrosine-protein kinase JAK3
Name:Tyrosine-protein kinase JAK3
Type:Protein
Mol. Mass.:125111.08
Organism:Homo sapiens (Human)
Description:P52333
Residue:1124
BDBM195827
NameBDBM195827
Synonyms:US9206188, 78 | US9834551, Example 78
TypeSmall organic molecule
Emp. Form.C17H14N4O
Mol. Mass.290.3193
SMILESCCC#CC(=O)Nc1cccc(n1)-c1cnc2[nH]ccc2c1