Reaction Details
TargetTyrosine-protein kinase JAK3
LigandBDBM195838
Substrate/Competitorn/a
Meas. Tech.Biochemical Inhibition Assay
IC50<5±n/a nM
Citation Vankayalapati, HYerramreddy, VGangireddy, PAppalaneni, RP Substituted pyrrolo[2,3-b]pyridines as ITK and JAK inhibitors US Patent US9206188 Publication Date 12/8/2015
 
Tyrosine-protein kinase JAK3
Name:Tyrosine-protein kinase JAK3
Type:Protein
Mol. Mass.:125111.08
Organism:Homo sapiens (Human)
Description:P52333
Residue:1124
BDBM195838
NameBDBM195838
Synonyms:US9206188, 89 | US9834551, Example 89
TypeSmall organic molecule
Emp. Form.C16H12N4O
Mol. Mass.276.2927
SMILESCc1c[nH]c2ncc(cc12)-c1cccc(NC(=O)C#C)n1